Console Output

Started by user Andrei Straut
Building in workspace /home/wildfly/.jenkins/workspace/Jenkins-API-TS-Typings-master
Cloning the remote Git repository
Cloning repository https://github.com/Andrei-Straut/jenkins-api-ts-typings
 > /usr/bin/git init /home/wildfly/.jenkins/workspace/Jenkins-API-TS-Typings-master # timeout=10
Fetching upstream changes from https://github.com/Andrei-Straut/jenkins-api-ts-typings
 > /usr/bin/git --version # timeout=10
using GIT_ASKPASS to set credentials 
 > /usr/bin/git fetch --tags --progress https://github.com/Andrei-Straut/jenkins-api-ts-typings +refs/heads/*:refs/remotes/origin/*
 > /usr/bin/git config remote.origin.url https://github.com/Andrei-Straut/jenkins-api-ts-typings # timeout=10
 > /usr/bin/git config --add remote.origin.fetch +refs/heads/*:refs/remotes/origin/* # timeout=10
 > /usr/bin/git config remote.origin.url https://github.com/Andrei-Straut/jenkins-api-ts-typings # timeout=10
Fetching upstream changes from https://github.com/Andrei-Straut/jenkins-api-ts-typings
using GIT_ASKPASS to set credentials 
 > /usr/bin/git fetch --tags --progress https://github.com/Andrei-Straut/jenkins-api-ts-typings +refs/heads/*:refs/remotes/origin/*
 > /usr/bin/git rev-parse refs/remotes/origin/master^{commit} # timeout=10
 > /usr/bin/git rev-parse refs/remotes/origin/origin/master^{commit} # timeout=10
Checking out Revision 288a5bc744e511819ca9db2f50b5505dbd51d9e0 (refs/remotes/origin/master)
Commit message: "Update README.md with Jenkins build status"
 > /usr/bin/git config core.sparsecheckout # timeout=10
 > /usr/bin/git checkout -f 288a5bc744e511819ca9db2f50b5505dbd51d9e0
First time build. Skipping changelog.
Unpacking https://nodejs.org/dist/v8.4.0/node-v8.4.0-linux-x64.tar.gz to /home/wildfly/.jenkins/tools/jenkins.plugins.nodejs.tools.NodeJSInstallation/NodeJS_8.4.0 on Jenkins
[Jenkins-API-TS-Typings-master] $ /bin/sh -xe /tmp/hudson1474286557284620372.sh
+ npm run test:prod

> jenkins-api-ts-typings@0.2.0 test:prod /home/wildfly/.jenkins/workspace/Jenkins-API-TS-Typings-master
> npm run lint && npm run test -- --coverage --no-cache


> jenkins-api-ts-typings@0.2.0 lint /home/wildfly/.jenkins/workspace/Jenkins-API-TS-Typings-master
> tslint --project tsconfig.json -t codeFrame 'src/**/*.ts'

sh: 1: tslint: not found
npm ERR! file sh
npm ERR! code ELIFECYCLE
npm ERR! errno ENOENT
npm ERR! syscall spawn
npm ERR! jenkins-api-ts-typings@0.2.0 lint: `tslint --project tsconfig.json -t codeFrame 'src/**/*.ts'`
npm ERR! spawn ENOENT
npm ERR! 
npm ERR! Failed at the jenkins-api-ts-typings@0.2.0 lint script.
npm ERR! This is probably not a problem with npm. There is likely additional logging output above.
npm WARN Local package.json exists, but node_modules missing, did you mean to install?

npm ERR! A complete log of this run can be found in:
npm ERR!     /home/wildfly/.npm/_logs/2017-08-16T21_58_03_143Z-debug.log
npm ERR! code ELIFECYCLE
npm ERR! errno 1
npm ERR! jenkins-api-ts-typings@0.2.0 test:prod: `npm run lint && npm run test -- --coverage --no-cache`
npm ERR! Exit status 1
npm ERR! 
npm ERR! Failed at the jenkins-api-ts-typings@0.2.0 test:prod script.
npm ERR! This is probably not a problem with npm. There is likely additional logging output above.
npm WARN Local package.json exists, but node_modules missing, did you mean to install?

npm ERR! A complete log of this run can be found in:
npm ERR!     /home/wildfly/.npm/_logs/2017-08-16T21_58_03_154Z-debug.log
Build step 'Execute shell' marked build as failure
Publishing Clover coverage report...
No Clover report will be published due to a Build Failure
Finished: FAILURE